Acetohydroxamic acid

Gas phase ion energetics data

Data evaluated as indicated in comments:
HL - Edward P. Hunter and Sharon G. Lias

Data compiled as indicated in comments:
B - John E. Bartmess

Quantity Value Units Method Reference Comment
Proton affinity (review)854.0kJ/molN/AHunter and Lias, 1998HL
Quantity Value Units Method Reference Comment
Gas basicity823.0kJ/molN/AHunter and Lias, 1998HL

De-protonation reactions

C2H4NO2- + Hydrogen cation = Acetohydroxamic acid

By formula: C2H4NO2- + H+ = C2H5NO2

Quantity Value Units Method Reference Comment
Δr1449. ± 9.6kJ/molG+TSDecouzon, Exner, et al., 1990gas phase; Acid: Acetohydroxamic acid; B
Quantity Value Units Method Reference Comment
Δr1419. ± 8.4kJ/molIMREDecouzon, Exner, et al., 1990gas phase; Acid: Acetohydroxamic acid; B

References

Hunter and Lias, 1998
Hunter, E.P.; Lias, S.G., Evaluated Gas Phase Basicities and Proton Affinities of Molecules: An Update, J. Phys. Chem. Ref. Data, 1998, 27, 3, 413-656, https://doi.org/10.1063/1.556018 . [all data]

Decouzon, Exner, et al., 1990
Decouzon, M.; Exner, O.; Gal, J.-F.; Maria, P.-C., The Gas-Phase Acidity and the Acidic Site of Acetohydroxamic Acid: an FT-ICR Study, J. Org. Chem., 1990, 55, 13, 3980, https://doi.org/10.1021/jo00300a007 . [all data]