1H-Isoindole-1,3(2H)-dione, 2-(3-bromopropyl)-

Phase change data

Data compiled by: William E. Acree, Jr., James S. Chickos

Quantity Value Units Method Reference Comment
Δsub116.0 ± 1.0kJ/molCRibeiro da Silva, Santos, et al., 2007

References

Ribeiro da Silva, Santos, et al., 2007
Ribeiro da Silva, Manuel A.V.; Santos, Cláudia P.F.; Monte, Manuel J.S.; Sousa, Carlos A.D., Thermochemical study of some chloro and bromo alkyl substituted phthalimides: Structural--energetic correlations, The Journal of Chemical Thermodynamics, 2007, 39, 10, 1363-1371, https://doi.org/10.1016/j.jct.2007.03.009 . [all data]