Benzene, (2,4-dimethylpentyl)-

Phase change data

Data compiled by: Thermodynamics Research Center, NIST Boulder Laboratories, Chris Muzny director

Quantity Value Units Method Reference Comment
Tboil492.16KN/ALamberti and Wise, 1953Uncertainty assigned by TRC = 0.3 K

In addition to the Thermodynamics Research Center (TRC) data available from this site, much more physical and chemical property data is available from the following TRC products:

Normal alkane RI, non-polar column, isothermal

View large format table.

Column type Active phase Temperature (C) I Reference Comment
CapillarySqualane130.1247.Papazova and Pankova, 1975N2; Column length: 100. m; Column diameter: 0.25 mm

References

Lamberti and Wise, 1953
Lamberti, J.M.; Wise, P.H., Synthesis and Physical Properties of Some C11 ANd C12 Phenylalkane and Cyclohexylalkane Hydrocarbons, J. Am. Chem. Soc., 1953, 75, 4787. [all data]