1H-Pyrrolizine-1-carboxylic acid, hexahydro-, methyl ester

Normal alkane RI, non-polar column, temperature ramp

View large format table.

Column type Active phase I Reference Comment
CapillaryOV-11283.Woldemichael and Wink, 200230. m/0.32 mm/0.25 μm, He, 70. C @ 3. min, 6. K/min; Tend: 300. C

References

Woldemichael and Wink, 2002
Woldemichael, G.M.; Wink, M., Concomitant occurrence of pyrrolizidine and quinolizidine alkaloids in hemiparasite Osyris alba L. (Santalaceae), Biochem. Syst. Ecol., 2002, 30, 2, 139-149, https://doi.org/10.1016/S0305-1978(01)00065-5 . [all data]