copper cyanide

Condensed phase thermochemistry data

Quantity Value Units Method Reference Comment
Δfsolid22.70kcal/molReviewChase, 1998Data last reviewed in December, 1971
Quantity Value Units Method Reference Comment
solid21.52cal/mol*KReviewChase, 1998Data last reviewed in December, 1971

Solid Phase Heat Capacity (Shomate Equation)

Cp° = A + B*t + C*t2 + D*t3 + E/t2
H° − H°298.15= A*t + B*t2/2 + C*t3/3 + D*t4/4 − E/t + F − H
S° = A*ln(t) + B*t + C*t2/2 + D*t3/3 − E/(2*t2) + G
    Cp = heat capacity (cal/mol*K)
    H° = standard enthalpy (kcal/mol)
    S° = standard entropy (cal/mol*K)
    t = temperature (K) / 1000.

View plot Requires a JavaScript / HTML 5 canvas capable browser.

View table.

Temperature (K) 298. - 1000.
A 15.05380
B 4.119291
C 1.576970
D -0.920951
E -0.150214
F 17.51550
G 37.60179
H 22.70010
ReferenceChase, 1998
Comment Data last reviewed in December, 1971

References

Chase, 1998
Chase, M.W., Jr., NIST-JANAF Themochemical Tables, Fourth Edition, J. Phys. Chem. Ref. Data, Monograph 9, 1998, 1-1951. [all data]