Butane, 1,1'-thiobis[3-methyl-

Phase change data

Data compiled as indicated in comments:
BS - Robert L. Brown and Stephen E. Stein
TRC - Thermodynamics Research Center, NIST Boulder Laboratories, Chris Muzny director
ALS - Hussein Y. Afeefy, Joel F. Liebman, and Stephen E. Stein
DRB - Donald R. Burgess, Jr.
AC - William E. Acree, Jr., James S. Chickos

Quantity Value Units Method Reference Comment
Tboil489.2KN/AWeast and Grasselli, 1989BS
Tboil488.0KN/ALecat, 1947Uncertainty assigned by TRC = 0.7 K; TRC
Quantity Value Units Method Reference Comment
Δvap60. ± 2.kJ/molVMackle and Mayrick, 1962ALS
Δvap60.0kJ/molN/AMackle and Mayrick, 1962DRB

Enthalpy of vaporization

ΔvapH (kJ/mol) Temperature (K) Method Reference Comment
57.9352.AStephenson and Malanowski, 1987Based on data from 339. - 366. K. See also Dykyj, Svoboda, et al., 1999.; AC
56.9352.CMackle and Mayrick, 1962, 2Based on data from 340. - 365. K.; AC

Antoine Equation Parameters

log10(P) = A − (B / (T + C))
    P = vapor pressure (bar)
    T = temperature (K)

View plot Requires a JavaScript / HTML 5 canvas capable browser.

Temperature (K) A B C Reference Comment
283. - 353.-6.17216915.744-574.249Bauer and Burschkies, 1935Coefficents calculated by NIST from author's data.

In addition to the Thermodynamics Research Center (TRC) data available from this site, much more physical and chemical property data is available from the following TRC products:

Condensed phase thermochemistry data

Data compiled by: Hussein Y. Afeefy, Joel F. Liebman, and Stephen E. Stein

Quantity Value Units Method Reference Comment
Δfliquid-282. ± 2.kJ/molCcbMackle and Mayrick, 1962
Quantity Value Units Method Reference Comment
Δcliquid-7399.1 ± 2.1kJ/molCcbMackle and Mayrick, 1962

Kovats' RI, non-polar column, isothermal

Data compiled by: NIST Mass Spectrometry Data Center, William E. Wallace, director

Column type PackedPacked
Active phase Apiezon MApiezon M
Column length (m) 2.12.1
Carrier gas He or N2N2
Substrate Chromosorb W, AW-DMCSChromosorb W
Column diameter (mm)
Phase thickness (μm)
Temperature (C) 130.130.
I 1197.1196.
ReferenceGarbuzov, Misharina, et al., 1985Golovnya and Garbuzov, 1974
Comment MSDC-RI MSDC-RI

References

Weast and Grasselli, 1989
CRC Handbook of Data on Organic Compounds, 2nd Editon, Weast,R.C and Grasselli, J.G., ed(s)., CRC Press, Inc., Boca Raton, FL, 1989, 1. [all data]

Lecat, 1947
Lecat, M., Orthobaric Azeotropes of Sulfides, Bull. Cl. Sci., Acad. R. Belg., 1947, 33, 160-82. [all data]

Mackle and Mayrick, 1962
Mackle, H.; Mayrick, R.G., Studies in the thermochemistry of organic sulphides. Part 2. The gas-phase heats of formation of ten aliphatic sulphides, Trans. Faraday Soc., 1962, 58, 230-237. [all data]

Stephenson and Malanowski, 1987
Stephenson, Richard M.; Malanowski, Stanislaw, Handbook of the Thermodynamics of Organic Compounds, 1987, https://doi.org/10.1007/978-94-009-3173-2 . [all data]

Dykyj, Svoboda, et al., 1999
Dykyj, J.; Svoboda, J.; Wilhoit, R.C.; Frenkel, M.L.; Hall, K.R., Vapor Pressure of Chemicals: Part A. Vapor Pressure and Antoine Constants for Hydrocarbons and Sulfur, Selenium, Tellurium and Hydrogen Containing Organic Compounds, Springer, Berlin, 1999, 373. [all data]

Mackle and Mayrick, 1962, 2
Mackle, H.; Mayrick, R.G., Studies in the thermochemistry of organic sulphides. Part 2.?The gas-phase heats of formation of ten aliphatic sulphides, Trans. Faraday Soc., 1962, 58, 230, https://doi.org/10.1039/tf9625800230 . [all data]

Bauer and Burschkies, 1935
Bauer, H.; Burschkies, K., Sattigungsdrucke einiger Senfole und Sulfide, Ber. Dtsch. Chem. Ges., 1935, 68, 6, 1238-1243, https://doi.org/10.1002/cber.19350680645 . [all data]