2,3,4,6-Tetrachlorophenyl acetate

Kovats' RI, non-polar column, isothermal

View large format table.

Column type Active phase Temperature (C) I Reference Comment
CapillarySE-30160.1617.Evans and Haken, 1989Column length: 25. m; Column diameter: 0.32 mm
CapillaryOV-101160.1617.Haken and Korhonen, 1983N2; Column length: 25. m; Column diameter: 0.22 mm
CapillaryOV-101180.1637.Haken and Korhonen, 1983N2; Column length: 25. m; Column diameter: 0.22 mm

Kovats' RI, polar column, isothermal

View large format table.

Column type Active phase Temperature (C) I Reference Comment
CapillaryOV-351160.2236.Evans and Haken, 1989Column length: 25. m; Column diameter: 0.32 mm

Van Den Dool and Kratz RI, non-polar column, temperature ramp

View large format table.

Column type Active phase I Reference Comment
CapillaryZB-11617.Urbanczyk, Staniewski, et al., 200230. m/0.25 mm/0.50 μm, He, 50. C @ 3. min, 10. K/min, 280. C @ 10. min

References

Evans and Haken, 1989
Evans, M.B.; Haken, J.K., Dispersion and selectivity indices in gas chromatography. IV. Chlorinated aromatic compounds, J. Chromatogr., 1989, 468, 373-382, https://doi.org/10.1016/S0021-9673(00)96332-5 . [all data]

Haken and Korhonen, 1983
Haken, J.K.; Korhonen, I.O.O., Gas chromatography of homologous esters. XXI. Capillary column studies of the chlorinated phenyl acetates, J. Chromatogr., 1983, 257, 267-273, https://doi.org/10.1016/S0021-9673(01)88182-6 . [all data]

Urbanczyk, Staniewski, et al., 2002
Urbanczyk, A.; Staniewski, J.; Szymanowski, J., Abraham model in gas chromatography of phenol pollutants, Anal. Chim. Acta., 2002, 466, 1, 151-159, https://doi.org/10.1016/S0003-2670(02)00544-5 . [all data]