Propanenitrile, 3-chloro-

Phase change data

Data compiled as indicated in comments:
BS - Robert L. Brown and Stephen E. Stein
TRC - Thermodynamics Research Center, NIST Boulder Laboratories, Chris Muzny director

Quantity Value Units Method Reference Comment
Tboil448.7KN/AWeast and Grasselli, 1989BS
Quantity Value Units Method Reference Comment
Tfus221.63KN/AWitschonke, 1954Uncertainty assigned by TRC = 0.2 K; TRC
Tfus221.7KN/AWitschonke, 1954Uncertainty assigned by TRC = 0.1 K; TRC

In addition to the Thermodynamics Research Center (TRC) data available from this site, much more physical and chemical property data is available from the following TRC products:

Gas phase ion energetics data

Data evaluated by: Edward P. Hunter and Sharon G. Lias

Quantity Value Units Method Reference Comment
Proton affinity (review)773.1kJ/molN/AHunter and Lias, 1998
Quantity Value Units Method Reference Comment
Gas basicity742.4kJ/molN/AHunter and Lias, 1998

References

Weast and Grasselli, 1989
CRC Handbook of Data on Organic Compounds, 2nd Editon, Weast,R.C and Grasselli, J.G., ed(s)., CRC Press, Inc., Boca Raton, FL, 1989, 1. [all data]

Witschonke, 1954
Witschonke, C.R., Freezing point and purity data for some organic compounds, Anal. Chem., 1954, 26, 562-4. [all data]