1,2-Ethanediol, monoacetate

Phase change data

Data compiled as indicated in comments:
BS - Robert L. Brown and Stephen E. Stein
AC - William E. Acree, Jr., James S. Chickos

Quantity Value Units Method Reference Comment
Tboil461.2KN/AWeast and Grasselli, 1989BS
Quantity Value Units Method Reference Comment
Δvap63.9 ± 0.3kJ/molGSVerevkin, Emel'yanenko, et al., 2009Based on data from 301. - 346. K.; AC

Enthalpy of vaporization

ΔvapH (kJ/mol) Temperature (K) Method Reference Comment
55.1378.EBSchmid, Döker, et al., 2007Based on data from 363. - 448. K.; AC

Van Den Dool and Kratz RI, non-polar column, custom temperature program

View large format table.

Column type Active phase I Reference Comment
CapillaryVF-5MS858.7Zheng and White, 200830. m/0.25 mm/0.25 μm, He; Program: not specified

Normal alkane RI, non-polar column, custom temperature program

View large format table.

Column type Active phase I Reference Comment
CapillaryPolydimethyl siloxanes844.Zenkevich and Chupalov, 1996Program: not specified

References

Weast and Grasselli, 1989
CRC Handbook of Data on Organic Compounds, 2nd Editon, Weast,R.C and Grasselli, J.G., ed(s)., CRC Press, Inc., Boca Raton, FL, 1989, 1. [all data]

Verevkin, Emel'yanenko, et al., 2009
Verevkin, Sergey P.; Emel'yanenko, Vladimir N.; Toktonov, Alexey V.; Leolko, Anna S.; Duwensee, Julia; Kragl, Udo; Sarge, Stefan M., Thermochemical and Ab Initio Studies of Biodiesel Fuel Surrogates: 1,2,3-Propanetriol Triacetate, 1,2-Ethanediol Diacetate, and 1,2-Ethanediol Monoacetate «8224», Ind. Eng. Chem. Res., 2009, 48, 15, 7388-7399, https://doi.org/10.1021/ie900308u . [all data]

Schmid, Döker, et al., 2007
Schmid, Bastian; Döker, Michael; Gmehling, Jürgen, Measurement of the thermodynamic properties for the reactive system ethylene glycol--acetic acid, Fluid Phase Equilibria, 2007, 258, 2, 115-124, https://doi.org/10.1016/j.fluid.2007.05.030 . [all data]