Benzene, 1,2,5-trichloro-3-methoxy-

Kovats' RI, non-polar column, isothermal

Data compiled by: NIST Mass Spectrometry Data Center, William E. Wallace, director

Column type CapillaryCapillaryCapillary
Active phase SE-30SE-30SE-30
Column length (m) 25.25.25.
Carrier gas N2N2N2
Substrate
Column diameter (mm) 0.30.30.3
Phase thickness (μm)
Temperature (C) 140.160.180.
I 1428.1437.1452.
ReferenceKorhonen, 1984Korhonen, 1984Korhonen, 1984
Comment MSDC-RI MSDC-RI MSDC-RI

Kovats' RI, polar column, isothermal

View large format table.

Column type Active phase Temperature (C) I Reference Comment
CapillaryOV-351140.2067.Korhonen, 1984N2; Column length: 25. m; Column diameter: 0.32 mm
CapillaryOV-351160.2085.Korhonen, 1984N2; Column length: 25. m; Column diameter: 0.32 mm
CapillaryOV-351180.2098.Korhonen, 1984N2; Column length: 25. m; Column diameter: 0.32 mm

Van Den Dool and Kratz RI, non-polar column, temperature ramp

View large format table.

Column type Active phase I Reference Comment
CapillarySE-301440.Korhonen, 1984N2, 10. K/min; Column length: 25. m; Column diameter: 0.3 mm; Tstart: 100. C
CapillarySE-301418.Korhonen, 1984N2, 2. K/min; Column length: 25. m; Column diameter: 0.3 mm; Tstart: 100. C
CapillarySE-301433.Korhonen, 1984N2, 6. K/min; Column length: 25. m; Column diameter: 0.3 mm; Tstart: 100. C

Van Den Dool and Kratz RI, non-polar column, custom temperature program

View large format table.

Column type Active phase I Reference Comment
CapillaryVF-5MS1470.8Tret'yakov, 200730. m/0.25 mm/0.25 μm, He; Program: Multi-step temperature program; T(initial)=60C; T(final)=270C

Van Den Dool and Kratz RI, polar column, temperature ramp

View large format table.

Column type Active phase I Reference Comment
CapillaryOV-3512065.Korhonen, 1984N2, 10. K/min; Column length: 25. m; Column diameter: 0.32 mm; Tstart: 100. C
CapillaryOV-3512047.Korhonen, 1984N2, 2. K/min; Column length: 25. m; Column diameter: 0.32 mm; Tstart: 100. C
CapillaryOV-3512060.Korhonen, 1984N2, 6. K/min; Column length: 25. m; Column diameter: 0.32 mm; Tstart: 100. C

Normal alkane RI, non-polar column, custom temperature program

View large format table.

Column type Active phase I Reference Comment
CapillaryCP Sil 21426.Fuhrer, Deissler, et al., 199755. m/0.25 mm/0.25 μm, N2; Program: 40C(3min) => 20C/min => 80C => 2C/min => 240C(45min)

References

Korhonen, 1984
Korhonen, I.O.O., Gas-Liquid Chromatographic Analyses. XXVIII. Capillary Column Studies of Chlorinated Anisoles, J. Chromatogr., 1984, 294, 99-116, https://doi.org/10.1016/S0021-9673(01)96118-7 . [all data]