Butane, 1-iodo-3-methyl-

Phase change data

Data compiled as indicated in comments:
TRC - Thermodynamics Research Center, NIST Boulder Laboratories, Chris Muzny director
AC - William E. Acree, Jr., James S. Chickos

Quantity Value Units Method Reference Comment
Tboil419.KN/AOgata and Aoki, 1969Uncertainty assigned by TRC = 3. K; TRC
Tboil420.8KN/ALecat, 1943Uncertainty assigned by TRC = 0.25 K; TRC
Tboil420.80KN/ALecat, 1927Uncertainty assigned by TRC = 0.5 K; TRC
Tboil420.80KN/ALecat, 1927, 2Uncertainty assigned by TRC = 0.5 K; TRC
Tboil420.80KN/ALecat, 1926Uncertainty assigned by TRC = 0.5 K; TRC
Quantity Value Units Method Reference Comment
Δvap42.2kJ/molCGCChickos, Hosseini, et al., 1995Based on data from 313. - 353. K.; AC

Enthalpy of vaporization

ΔvapH (kJ/mol) Temperature (K) Method Reference Comment
43.5285.AStephenson and Malanowski, 1987Based on data from 270. - 422. K. See also Stull, 1947.; AC

Antoine Equation Parameters

log10(P) = A − (B / (T + C))
    P = vapor pressure (bar)
    T = temperature (K)

View plot Requires a JavaScript / HTML 5 canvas capable browser.

Temperature (K) A B C Reference Comment
270.7 - 421.44.366281652.983-42.395Stull, 1947Coefficents calculated by NIST from author's data.

In addition to the Thermodynamics Research Center (TRC) data available from this site, much more physical and chemical property data is available from the following TRC products:

Gas phase ion energetics data

Data compiled as indicated in comments:
LL - Sharon G. Lias and Joel F. Liebman
LLK - Sharon G. Lias, Rhoda D. Levin, and Sherif A. Kafafi

Ionization energy determinations

IE (eV) Method Reference Comment
9.18ESTLuo and Pacey, 1992LL
9.20PEBoschi and Salahub, 1974LLK
9.20PEBoschi and Salahub, 1972LLK
9.192SBoschi and Salahub, 1972LLK
9.17 ± 0.01PECocksey, Eland, et al., 1971LLK

Condensed phase thermochemistry data

Data compiled by: Eugene S. Domalski and Elizabeth D. Hearing

Constant pressure heat capacity of liquid

Cp,liquid (J/mol*K) Temperature (K) Reference Comment
178.7298.Kurbatov, 1948T = 13 to 137°C, mean Cp, three temperatures.

References

Ogata and Aoki, 1969
Ogata, Y.; Aoki, K., Reaction of Alkyl Iodides with Peracetic Acid in the Presence of Aromatic Compounds, J. Org. Chem., 1969, 34, 3974. [all data]

Lecat, 1943
Lecat, M., Azeotropes of Ethyl Urethane and other Azeotropes, C. R. Hebd. Seances Acad. Sci., 1943, 217, 273. [all data]

Lecat, 1927
Lecat, M., New binary azeotropes: 5th list, Recl. Trav. Chim. Pays-Bas, 1927, 46, 240-7. [all data]

Lecat, 1927, 2
Lecat, M., New binary azeotropes: 6th list, Ann. Soc. Sci. Bruxelles, Ser. B, 1927, 47, 63-71. [all data]

Lecat, 1926
Lecat, M., New binary azeotropes second list, Recl. Trav. Chim. Pays-Bas, 1926, 45, 620-627. [all data]

Chickos, Hosseini, et al., 1995
Chickos, James S.; Hosseini, Sarah; Hesse, Donald G., Determination of vaporization enthalpies of simple organic molecules by correlations of changes in gas chromatographic net retention times, Thermochimica Acta, 1995, 249, 41-62, https://doi.org/10.1016/0040-6031(95)90670-3 . [all data]

Stephenson and Malanowski, 1987
Stephenson, Richard M.; Malanowski, Stanislaw, Handbook of the Thermodynamics of Organic Compounds, 1987, https://doi.org/10.1007/978-94-009-3173-2 . [all data]

Stull, 1947
Stull, Daniel R., Vapor Pressure of Pure Substances. Organic and Inorganic Compounds, Ind. Eng. Chem., 1947, 39, 4, 517-540, https://doi.org/10.1021/ie50448a022 . [all data]