N,1-Dimethylhexylamine

Kovats' RI, non-polar column, isothermal

View large format table.

Column type Active phase Temperature (C) I Reference Comment
PackedApiezon L100.990.Donike and Stratmann, 1976Chromosorb W

Kovats' RI, polar column, isothermal

View large format table.

Column type Active phase Temperature (C) I Reference Comment
PackedPEG-20M70.1130.Donike and Stratmann, 1976Chromosorb W

Normal alkane RI, non-polar column, isothermal

View large format table.

Column type Active phase Temperature (C) I Reference Comment
CapillaryApieson L / KOH150.982.Caddy, Fish, et al., 1973
CapillaryApieson L / KOH150.991.Caddy, Fish, et al., 1973
CapillaryApieson L / KOH150.992.Caddy, Fish, et al., 1973

Normal alkane RI, polar column, isothermal

View large format table.

Column type Active phase Temperature (C) I Reference Comment
CapillaryCarbowax 20M / KOH150.1126.Caddy, Fish, et al., 1973
CapillaryCarbowax 20M / KOH150.1127.Caddy, Fish, et al., 1973
CapillaryCarbowax 20M / KOH150.1147.Caddy, Fish, et al., 1973

References

Donike and Stratmann, 1976
Donike, M.; Stratmann, D., Gas-chromatographische identifizierung von stimulantien der phenyläthylaminreihe mit hilfe der retnetions-indices, Z. Anal. Chem., 1976, 279, 2, 129-131, https://doi.org/10.1007/BF00440798 . [all data]

Caddy, Fish, et al., 1973
Caddy, B.; Fish, F.; Scott, D., Chromatographic screening for drugs of abuse using capillary columds. II. Peak identification on support coated open tubular columns for a series of central nervous system stimulating drugs, Chromatographia, 1973, 6, 7, 293-300, https://doi.org/10.1007/BF02269329 . [all data]