Pentanoic acid, 4-oxo-, ethyl ester

Normal alkane RI, non-polar column, temperature ramp

Data compiled by: NIST Mass Spectrometry Data Center, William E. Wallace, director

Column type CapillaryCapillaryCapillary
Active phase DB-1DB-1DB-5
Column length (m) 60.60.30.
Carrier gas   Hydrogen
Substrate
Column diameter (mm) 0.320.320.35
Phase thickness (μm) 0.250.251.0
Tstart (C) 50.50.45.
Tend (C) 250.250.220.
Heat rate (K/min) 4.4.2.
Initial hold (min)
Final hold (min)
I 1023.1024.1070.
ReferenceFlath, Matsumoto, et al., 1989Flath, Matsumoto, et al., 1989Georgilopoulos and Gallois, 1988
Comment MSDC-RI MSDC-RI MSDC-RI

Phase change data

Data compiled as indicated in comments:
BS - Robert L. Brown and Stephen E. Stein
AC - William E. Acree, Jr., James S. Chickos

Quantity Value Units Method Reference Comment
Tboil479.0KN/AWeast and Grasselli, 1989BS

Reduced pressure boiling point

Tboil (K) Pressure (atm) Reference Comment
366.70.024Aldrich Chemical Company Inc., 1990BS

Enthalpy of vaporization

ΔvapH (kcal/mol) Temperature (K) Method Reference Comment
13.9335.AStephenson and Malanowski, 1987Based on data from 320. - 480. K. See also Stull, 1947.; AC
12.3420.N/ASchuette and Cowley, 1931AC

Antoine Equation Parameters

log10(P) = A − (B / (T + C))
    P = vapor pressure (atm)
    T = temperature (K)

View plot Requires a JavaScript / HTML 5 canvas capable browser.

Temperature (K) A B C Reference Comment
320.4 - 479.44.992262165.008-45.466Stull, 1947Coefficents calculated by NIST from author's data.

References

Flath, Matsumoto, et al., 1989
Flath, R.A.; Matsumoto, K.E.; Binder, R.G.; Cunningham, R.T.; Mon, T.R., Effect of pH on the volatiles of hydrolyzed protein insect baits, J. Agric. Food Chem., 1989, 37, 3, 814-819, https://doi.org/10.1021/jf00087a053 . [all data]

Georgilopoulos and Gallois, 1988
Georgilopoulos, D.N.; Gallois, A.N., Flavour compounds of a commercial concentrated blackberry juice, Food Chem., 1988, 28, 2, 141-148, https://doi.org/10.1016/0308-8146(88)90143-4 . [all data]