7-Octen-4-ol

Normal alkane RI, polar column, custom temperature program

Data compiled by: NIST Mass Spectrometry Data Center, William E. Wallace, director

Column type Capillary
Active phase CP Wax 52 CB
Column length (m) 50.
Carrier gas
Substrate
Column diameter (mm) 0.32
Phase thickness (μm) 0.20
Program 50 0C (10 min) 2 0C/min -> 100 0C 5 0C/min -> 150 0C 7 0C/min -> 220 0C (20 min)
I 1449.
ReferencePatterson and Stevenson, 1995
Comment MSDC-RI

References

Patterson and Stevenson, 1995
Patterson, R.L.S.; Stevenson, M.H., Irradiation-induced off-odor in chicken and its possible control, British Poultry Science, 1995, 36, 3, 425-441, https://doi.org/10.1080/00071669508417789 . [all data]