1-Pentanethiol, 4-methyl-

Phase change data

Data compiled by: Thermodynamics Research Center, NIST Boulder Laboratories, Chris Muzny director

Quantity Value Units Method Reference Comment
Tboil418.05KN/ALanum and Morris, 1969Uncertainty assigned by TRC = 0.2 K

In addition to the Thermodynamics Research Center (TRC) data available from this site, much more physical and chemical property data is available from the following TRC products:

References

Lanum and Morris, 1969
Lanum, W.J.; Morris, J.C., Physical Properties of Some Sulfur and Nitrogen Compounds, J. Chem. Eng. Data, 1969, 14, 93-8. [all data]