Estra-1,3,5(10)-trien-3-ol

Reaction thermochemistry data

Data compiled by: John E. Bartmess

Individual Reactions

C18H23O- + Hydrogen cation = Estra-1,3,5(10)-trien-3-ol

By formula: C18H23O- + H+ = C18H24O

Quantity Value Units Method Reference Comment
Δr343.9 ± 2.4kcal/molCIDTBourgoin-Voillard, Zins, et al., 2009gas phase
Quantity Value Units Method Reference Comment
Δr339.5 ± 2.8kcal/molH-TSBourgoin-Voillard, Zins, et al., 2009gas phase

References

Bourgoin-Voillard, Zins, et al., 2009
Bourgoin-Voillard, S.; Zins, E.L.; Fournier, F.; Jacquot, Y.; Afonso, C.; Pepe, C.; Leclercq, G.; Tabet, J.C., Stereochemical Effects During [M-H](-) Dissociations of Epimeric 11-OH-17 beta-Estradiols and Distant Electronic Effects of Substituents at C-(11) Position on Gas Phase Acidity, J. Am. Soc. Mass Spectrom., 2009, 20, 12, 2318-2333, https://doi.org/10.1016/j.jasms.2009.08.017 . [all data]