Methyl 11-oxo-9-undecenoate

Normal alkane RI, non-polar column, temperature ramp

View large format table.

Column type Active phase I Reference Comment
CapillaryHP-5MS1698.Hadaruga, Hadaruga, et al., 200630. m/0.25 mm/0.25 μm, He, 4. K/min; Tstart: 50. C; Tend: 250. C

References

Hadaruga, Hadaruga, et al., 2006
Hadaruga, N.G.; Hadaruga, D.I.; Paunescu, V.; Tatu, C.; Ordodi, V.L.; Bandur, G.; Lupea, A.X., Thermal stability of the linoleic acid/α- and β-cyclodextrin complexes, Food Chem., 2006, 99, 3, 500-508, https://doi.org/10.1016/j.foodchem.2005.08.012 . [all data]