Trigonelline

Reaction thermochemistry data

Data compiled by: John E. Bartmess

Individual Reactions

C7H6NO2 + Hydrogen cation = Trigonelline

By formula: C7H6NO2 + H+ = C7H7NO2

Quantity Value Units Method Reference Comment
Δr1507. ± 21.kJ/molD-EAWang, Broadus, et al., 2000gas phase; ArCO2-: EAad = 3.8±0.1 eV
Δr1448. ± 21.kJ/molG+TSBroadus and Kass, 2000gas phase
Quantity Value Units Method Reference Comment
Δr1474. ± 21.kJ/molH-TSWang, Broadus, et al., 2000gas phase; ArCO2-: EAad = 3.8±0.1 eV
Δr1415. ± 21.kJ/molIMRBBroadus and Kass, 2000gas phase

References

Wang, Broadus, et al., 2000
Wang, X.B.; Broadus, K.M.; Wang, L.S.; Kass, S.R., Photodetachment of the first zwitterionic anions in the gas phase: Probing intramolecular Coulomb repulsion and attraction, J. Am. Chem. Soc., 2000, 122, 34, 8305-8306, https://doi.org/10.1021/ja001943z . [all data]

Broadus and Kass, 2000
Broadus, K.M.; Kass, S.R., Probing Electrostatic Effects: Formation and Characterization of Zwitterionic Ions and their Neutral Counterparts in the Gas Phase, J. Am. Chem. Soc., 2000, 122, 37, 9014, https://doi.org/10.1021/ja0016708 . [all data]