Dibenzo-p-dioxin, 1,2,3,8-tetrachloro-

Normal alkane RI, non-polar column, custom temperature program

Data compiled by: NIST Mass Spectrometry Data Center, William E. Wallace, director

Column type CapillaryCapillaryCapillary
Active phase DB-5DB-5DB-5
Column length (m)
Carrier gas
Substrate
Column diameter (mm)
Phase thickness (μm)
Program not specifiednot specifiednot specified
I 2382.2382.2382.
ReferenceLin, Liu, et al., 2002Lin, Liu, et al., 2002Lin, Liu, et al., 2002
Comment MSDC-RI MSDC-RI MSDC-RI

Normal alkane RI, non-polar column, temperature ramp

Data compiled by: NIST Mass Spectrometry Data Center, William E. Wallace, director

Column type Capillary
Active phase DB-5
Column length (m) 60.
Carrier gas He
Substrate
Column diameter (mm) 0.25
Phase thickness (μm) 0.25
Tstart (C) 170.
Tend (C) 340.
Heat rate (K/min) 2.
Initial hold (min) 1.
Final hold (min)
I 2382.
ReferenceZhao and Yu, 2007
Comment MSDC-RI

References

Lin, Liu, et al., 2002
Lin, Z.; Liu, S.; Li, Z., Molecular modeling of quantitative structure retention relationship studies: retention behavior of polychlorinated dibenzofurans on gas chromatographic stationary phases of varying polarity by a novel molecular distance edge vector, J. Chromatogr. Sci., 2002, 40, 7-13. [all data]