Prasterone

Condensed phase thermochemistry data

Data compiled by: Hussein Y. Afeefy, Joel F. Liebman, and Stephen E. Stein

Quantity Value Units Method Reference Comment
Δcsolid-2636. ± 4.kcal/molCcbPaoli, Garrigues, et al., 1969Corresponding Δfsolid = -107. kcal/mol (simple calculation by NIST; no Washburn corrections)

References

Paoli, Garrigues, et al., 1969
Paoli, D.; Garrigues, J.-C.; Patin, H., Combustion microcalorimetry: application to steroids, C. R. Acad. Sci. Paris, 1969, 268, 780-783. [all data]