2-methyl-2-pentanamine

Phase change data

Data compiled by: Thermodynamics Research Center, NIST Boulder Laboratories, Chris Muzny director

Quantity Value Units Method Reference Comment
Tboil375.KN/ABrown and van Gulick, 1955Uncertainty assigned by TRC = 6. K

In addition to the Thermodynamics Research Center (TRC) data available from this site, much more physical and chemical property data is available from the following TRC products:

References

Brown and van Gulick, 1955
Brown, R.F.; van Gulick, N.M., The Preparation of Geminally Substituted 4-Bromobutylamines I. 4-Bromobutylamine and 4-Bromo-1,1-dimethylbutylamine, J. Am. Chem. Soc., 1955, 77, 1079. [all data]