Adenosine, 4TMS derivative

Kovats' RI, non-polar column, isothermal

Data compiled by: NIST Mass Spectrometry Data Center, William E. Wallace, director

Column type PackedPacked
Active phase OV-1OV-1
Column length (m)  1.
Carrier gas N2
Substrate Gas-Chrom QGas Chrom Q
Column diameter (mm)
Phase thickness (μm)
Temperature (C) 230.230.
I 2647.2647.
ReferenceQuilliam, Ogilvie, et al., 1980Quilliam and Westmore, 1978
Comment MSDC-RI MSDC-RI

References

Quilliam, Ogilvie, et al., 1980
Quilliam, M.A.; Ogilvie, K.K.; Sadana, K.L.; Westmore, J.B., Gas chromatographic retention data for silyl and acyl derivatives of nucleosides, J. Chromatogr., 1980, 196, 3, 367-378, https://doi.org/10.1016/S0021-9673(00)84739-1 . [all data]

Quilliam and Westmore, 1978
Quilliam, M.A.; Westmore, J.B., Sterically crowded trialkylsilyl derivatives for chromatography and mass spectrometry of biologically-important compounds, Anal. Chem., 1978, 50, 1, 59-68, https://doi.org/10.1021/ac50023a020 . [all data]