2-Hydroxy-5,5-dimethylcyclopent-2-en-1-one

Van Den Dool and Kratz RI, non-polar column, temperature ramp

View large format table.

Column type Active phase I Reference Comment
CapillaryOV-101954.Mihara and Nishimura, 1989N2, 2. K/min; Column length: 50. m; Column diameter: 0.22 mm; Tstart: 80. C; Tend: 200. C

Van Den Dool and Kratz RI, polar column, temperature ramp

View large format table.

Column type Active phase I Reference Comment
CapillaryCarbowax 20M1621.Mihara and Nishimura, 1989N2, 2. K/min; Column length: 50. m; Column diameter: 0.22 mm; Tstart: 80. C; Tend: 200. C

References

Mihara and Nishimura, 1989
Mihara, S.; Nishimura, O., Retention indices of 2-hydroxy-2-cyclopenten-1-ones, J. Hi. Res. Chromatogr., 1989, 12, 11, 763-764, https://doi.org/10.1002/jhrc.1240121116 . [all data]