2-Pentene, 2-methoxy-4-methyl-, (Z)-

Reaction thermochemistry data

Data compiled by: Hussein Y. Afeefy, Joel F. Liebman, and Stephen E. Stein

Individual Reactions

2-Methoxy-4-methyl-1-pentene = 2-Pentene, 2-methoxy-4-methyl-, (Z)-

By formula: C7H14O = C7H14O

Quantity Value Units Method Reference Comment
Δr12.16 ± 0.40kJ/molEqkTaskinen, 1974liquid phase; solvent: Cyclohexane; GLC

trans-2-Methyoxy-4-methyl-2-pentene = 2-Pentene, 2-methoxy-4-methyl-, (Z)-

By formula: C7H14O = C7H14O

Quantity Value Units Method Reference Comment
Δr11.46 ± 0.35kJ/molEqkTaskinen, 1974liquid phase; solvent: Cyclohexane; GLC

References

Taskinen, 1974
Taskinen, E., Thermodynamics of vinyl ethers. III. On the relative stabilities of 2-methoxy-1-butene, (E)-2-methoxy-2-butene, and (Z)-2-methoxy-2-butene, and related isomeric compounds, J. Chem. Thermodyn., 1974, 6, 345-353. [all data]