6-Methyl-2-methylthio-4-pyrone

Phase change data

Data compiled by: William E. Acree, Jr., James S. Chickos

Enthalpy of vaporization

ΔvapH (kJ/mol) Temperature (K) Method Reference Comment
62.7402.AStephenson and Malanowski, 1987Based on data from 387. - 432. K. See also Dykyj, Svoboda, et al., 1999 and Beak, Mueller, et al., 1974.

Enthalpy of sublimation

ΔsubH (kJ/mol) Temperature (K) Method Reference Comment
87.4 ± 3.8410.BBeak, Mueller, et al., 1974Based on data from 388. - 433. K.

References

Stephenson and Malanowski, 1987
Stephenson, Richard M.; Malanowski, Stanislaw, Handbook of the Thermodynamics of Organic Compounds, 1987, https://doi.org/10.1007/978-94-009-3173-2 . [all data]

Dykyj, Svoboda, et al., 1999
Dykyj, J.; Svoboda, J.; Wilhoit, R.C.; Frenkel, M.L.; Hall, K.R., Vapor Pressure of Chemicals: Part A. Vapor Pressure and Antoine Constants for Hydrocarbons and Sulfur, Selenium, Tellurium and Hydrogen Containing Organic Compounds, Springer, Berlin, 1999, 373. [all data]

Beak, Mueller, et al., 1974
Beak, P.; Mueller, D.S.; Lee, J., Equilibration studies. Determination of the enthalpy difference between methyltropic isomers from heats of methylation, J. Am. Chem. Soc., 1974, 96, 3867-3874. [all data]