Pulegol

Van Den Dool and Kratz RI, non-polar column, custom temperature program

Data compiled by: NIST Mass Spectrometry Data Center, William E. Wallace, director

Column type Capillary
Active phase SE-52
Column length (m) 60.
Carrier gas He
Substrate
Column diameter (mm) 0.32
Phase thickness (μm) 0.40
Program 45 C (6 min) 3 C/min -> 111 0C 2 C/min -> 160 C 3 C/min -> 300 C (15 min)
I 1158.
ReferenceMondello, Dugo, et al., 1995
Comment MSDC-RI

Van Den Dool and Kratz RI, non-polar column, temperature ramp

View large format table.

Column type Active phase I Reference Comment
CapillaryDB-51165.Agnihotri, Agarwal, et al., 200530. m/0.25 mm/0.25 μm, He, 90. C @ 2. min, 4. K/min; Tend: 220. C
CapillaryHP-51214.Javidnia, Miri, et al., 2004He, 3. K/min; Column length: 30. m; Column diameter: 0.25 mm; Tstart: 60. C; Tend: 260. C

Normal alkane RI, non-polar column, custom temperature program

View large format table.

Column type Active phase I Reference Comment
CapillarySE-301153.Vinogradov, 2004Program: not specified
CapillarySE-301213.Vinogradov, 2004Program: not specified
CapillaryDB-51213.Isidorov, Zenkevich, et al., 1997Program: not specified
CapillaryPolydimethyl siloxanes1213.Zenkevich, 1997Program: not specified

References

Mondello, Dugo, et al., 1995
Mondello, L.; Dugo, P.; Basile, A.; Dugo, G., Interactive use of linear retention indices, on polar and apolar columns, with a MS-library for reliable identification of complex mixtures, J. Microcolumn Sep., 1995, 7, 6, 581-591, https://doi.org/10.1002/mcs.1220070605 . [all data]