Benzoic acid, 3,4-dinitro-

Phase change data

Data compiled by: William E. Acree, Jr., James S. Chickos

Quantity Value Units Method Reference Comment
Δsub129. ± 2.kJ/molTEVecchio and Brunetti, 2009Based on data from 366. - 399. K.

Enthalpy of vaporization

ΔvapH (kJ/mol) Temperature (K) Method Reference Comment
91. ± 3.529.TGAVecchio and Brunetti, 2009Based on data from 518. - 540. K.
91. ± 1.521.TGAVecchio and Brunetti, 2009Based on data from 506. - 536. K.

Enthalpy of sublimation

ΔsubH (kJ/mol) Temperature (K) Method Reference Comment
126. ± 2.386.TEVecchio and Brunetti, 2009Based on data from 366. - 399. K.

Enthalpy of fusion

ΔfusH (kJ/mol) Temperature (K) Method Reference
24.6438.2DSCVecchio and Brunetti, 2009

References

Vecchio and Brunetti, 2009
Vecchio, Stefano; Brunetti, Bruno, Vapor pressures and standard molar enthalpies, entropies, and Gibbs free energies of sublimation of 2,4- and 3,4-dinitrobenzoic acids, The Journal of Chemical Thermodynamics, 2009, 41, 7, 880-887, https://doi.org/10.1016/j.jct.2009.02.008 . [all data]