(1aR,3aS,7S,7aS,7bR)-1,1,3a,7-Tetramethyldecahydro-1H-cyclopropa[a]naphthalen-7-ol

Normal alkane RI, non-polar column, temperature ramp

Data compiled by: NIST Mass Spectrometry Data Center, William E. Wallace, director

Column type CapillaryCapillaryCapillary
Active phase CP Sil 5 CBCP Sil 5 CBCP Sil 5 CB
Column length (m) 25.25.25.
Carrier gas N2N2He
Substrate
Column diameter (mm) 0.320.320.25
Phase thickness (μm) 0.250.250.25
Tstart (C) 50.50.60.
Tend (C) 290.290.300.
Heat rate (K/min) 4.4.6.
Initial hold (min)
Final hold (min)
I 1541.1541.1541.
ReferenceBos, Woerdenbag, et al., 1997Bos, Woerdenbag, et al., 1997Bos, Woerdenbag, et al., 1997, 2
Comment MSDC-RI MSDC-RI MSDC-RI

Van Den Dool and Kratz RI, non-polar column, temperature ramp

Data compiled by: NIST Mass Spectrometry Data Center, William E. Wallace, director

Column type CapillaryCapillary
Active phase HP-5RTX-1
Column length (m) 30.60.
Carrier gas HeHe
Substrate
Column diameter (mm) 0.250.22
Phase thickness (μm) 0.250.25
Tstart (C) 60.60.
Tend (C) 250.230.
Heat rate (K/min) 3.2.
Initial hold (min)
Final hold (min)  35.
I 1570.1559.
ReferenceJavidnia, Miri, et al., 2006Paolini, Costa, et al., 2005
Comment MSDC-RI MSDC-RI

References

Bos, Woerdenbag, et al., 1997
Bos, R.; Woerdenbag, H.J.; Hendriks, H.; Smit, H.F.; Wikström, H.V.; Scheffer, J.J.C., Composition of the essential oil from roots and rhizomes of Valeriana wallichii DC, Flavour Fragr. J., 1997, 12, 2, 123-131, https://doi.org/10.1002/(SICI)1099-1026(199703)12:2<123::AID-FFJ613>3.0.CO;2-4 . [all data]

Bos, Woerdenbag, et al., 1997, 2
Bos, R.; Woerdenbag, H.J.; Hendriks, H.; Scheffer, J.J.C., Composition of the essential oils from underground parts of Valeriana officinalis L. s.l. and several closely related taxa, Flavour Fragr. J., 1997, 12, 5, 359-370, https://doi.org/10.1002/(SICI)1099-1026(199709/10)12:5<359::AID-FFJ660>3.0.CO;2-G . [all data]