Cyclohexanone, 2,4-bis(1,1-dimethylethyl)-, cis-

Reaction thermochemistry data

Data compiled by: Hussein Y. Afeefy, Joel F. Liebman, and Stephen E. Stein

Individual Reactions

trans-2,4-Di-t-butylcyclohexanone = Cyclohexanone, 2,4-bis(1,1-dimethylethyl)-, cis-

By formula: C14H26O = C14H26O

Quantity Value Units Method Reference Comment
Δr-10. ± 1.6kJ/molEqkAllinger and Blatter, 1961liquid phase; solvent: Ethanol; Heat of isomerization

References

Allinger and Blatter, 1961
Allinger, N.L.; Blatter, H.M., Conformational analysis. SVI. The energy of the boat form of cyclohexanone. Direct measurements of 2-alkyl ketone effects, J. Am. Chem. Soc., 1961, 83, 994-995. [all data]