1,1'-Biphenyl, 2,2',3,4',5,5',6-heptachloro-

Phase change data

Data compiled by: William E. Acree, Jr., James S. Chickos

Enthalpy of vaporization

ΔvapH (kJ/mol) Temperature (K) Method Reference Comment
94.0368.GCFalconer and Bidleman, 1994Based on data from 343. - 393. K.

References

Falconer and Bidleman, 1994
Falconer, Renee L.; Bidleman, Terry F., Vapor pressures and predicted particle/gas distributions of polychlorinated biphenyl congeners as functions of temperature and ortho-chlorine substitution, Atmospheric Environment, 1994, 28, 3, 547-554, https://doi.org/10.1016/1352-2310(94)90130-9 . [all data]