6β-Hydroxyhyoscyamine

Normal alkane RI, non-polar column, temperature ramp

Data compiled by: NIST Mass Spectrometry Data Center, William E. Wallace, director

Column type Capillary
Active phase OV-1
Column length (m) 30.
Carrier gas He
Substrate
Column diameter (mm) 0.25
Phase thickness (μm)
Tstart (C) 120.
Tend (C) 300.
Heat rate (K/min) 8.
Initial hold (min) 3.
Final hold (min)
I 2355.
ReferenceZayed and Wink, 2004
Comment MSDC-RI

References

Zayed and Wink, 2004
Zayed, R.; Wink, M., Induction of tropane alkaloid formation in transformed root cultures of Brugmansia suaveolens (Solanaceae), Z. Naturforsch. C:, 2004, 59, 11-12, 863-867. [all data]