Cyclohexene, 3-methyl-6-(1-methylethyl)-

Kovats' RI, non-polar column, isothermal

View large format table.

Column type Active phase Temperature (C) I Reference Comment
CapillaryApiezon L100.1004.Morishita, Okano, et al., 1980Column length: 45. m; Column diameter: 0.25 mm
PackedSE-30160.985.Hedin, Thompson, et al., 1972N2, Chromosorb W; Column length: 6.145 m

Kovats' RI, non-polar column, temperature ramp

View large format table.

Column type Active phase I Reference Comment
CapillaryDB-51009.Buchin, Salmon, et al., 200260. m/0.32 mm/1. μm, He, 40. C @ 5. min, 3. K/min, 230. C @ 2. min
CapillaryHP-5985.Ramos, Siani, et al., 200030. m/0.32 mm/0.25 μm, He, 3. K/min; Tstart: 70. C; Tend: 250. C

Kovats' RI, polar column, isothermal

View large format table.

Column type Active phase Temperature (C) I Reference Comment
CapillaryPEG-20M100.1091.Morishita, Okano, et al., 1980Column length: 75. m; Column diameter: 0.25 mm

Normal alkane RI, non-polar column, temperature ramp

View large format table.

Column type Active phase I Reference Comment
CapillaryHP-1982.Antoniotti, Alezra, et al., 200450. m/0.2 mm/0.33 μm, 2. K/min, 250. C @ 10. min; Tstart: 60. C

References

Morishita, Okano, et al., 1980
Morishita, F.; Okano, T.; Kojima, T., Retention indices of monocyclic monoterpene hydrocarbons, Bunseki Kagaku, 1980, 29, 1, 48-53, https://doi.org/10.2116/bunsekikagaku.29.48 . [all data]

Hedin, Thompson, et al., 1972
Hedin, P.A.; Thompson, A.C.; Gueldner, R.C., Application of a Sequential Reduction Regimen to Fractionation of Essential Oils, Anal. Chem., 1972, 44, 7, 1254-1257, https://doi.org/10.1021/ac60315a030 . [all data]

Buchin, Salmon, et al., 2002
Buchin, S.; Salmon, J.-C.; Carnat, A.-P.; Berger, T.; Bugaud, C.; Bosset, J.O., Identification de composés monoterpéniques, sesquiterpéniques et benzéniques dans un lait d'alpage très riche en ces substances, Mitt. Lebensmittelunters. Hyg., 2002, 93, 199-216. [all data]

Ramos, Siani, et al., 2000
Ramos, M.F.S.; Siani, A.C.; Tappin, M.R.R.; Guimaraes, A.C.; Lahoz, J.E.; Ribeiro, J.E.L.S., Essential oils from oleoresins of Protium spp. of the Amazon region, Flavour Fragr. J., 2000, 15, 6, 383-387, https://doi.org/10.1002/1099-1026(200011/12)15:6<383::AID-FFJ927>3.0.CO;2-X . [all data]

Antoniotti, Alezra, et al., 2004
Antoniotti, S.; Alezra, N.; Fernandez, X.; Duñach, E., Catalytic epoxide oxidation: a novel access to flavouring and odorant α-diketones, Flavour Fragr. J., 2004, 19, 5, 373-381, https://doi.org/10.1002/ffj.1371 . [all data]