Silane,chlorodimethyl(phenylthio)-

Gas phase ion energetics data

Data compiled by: Sharon G. Lias, Rhoda D. Levin, and Sherif A. Kafafi

Ionization energy determinations

IE (eV) Method Reference
8.8 ± 0.1EIDistefano, Ricci, et al., 1974

Appearance energy determinations

Ion AE (eV) Other Products MethodReferenceComment
C2H6SiCl+10.8 ± 0.1?EIDistefano, Ricci, et al., 1974

References

Distefano, Ricci, et al., 1974
Distefano, G.; Ricci, A.; Danieli, R.; Foffani, A.; Innorta, G.; Torroni, S., Mass spectrometric evidence for p π-d π bonding between sulfur and the Group IVB elements, J. Organomet. Chem., 1974, 65, 205. [all data]