2-(Dimethylamino)-2-methyl-1-phenylpropanone

Phase change data

Data compiled by: William E. Acree, Jr., James S. Chickos

Quantity Value Units Method Reference Comment
Δvap66.7 ± 0.4kJ/molGSWelle, Verevkin, et al., 1994Based on data from 298. - 338. K.

References

Welle, Verevkin, et al., 1994
Welle, f.; Verevkin, S.P.; Keller, M.; Beckhaus, H.-D.; Ruchardt, C., Kinetische und thermodynamische Stabilitat von 2,3-Bis(dialkylamino)-1,4-diketonen - Stabilisierungsenergie capto-dativ substituierter α-Dialkylamino-α-Carbonylalkyl-Radikale, Chem. Ber., 1994, 127, 697-710. [all data]