Buprenorphine

Phase change data

Data compiled by: William E. Acree, Jr., James S. Chickos

Enthalpy of fusion

ΔfusH (kJ/mol) Temperature (K) Reference
26.8491.3Stinchcomb, Dua, et al., 1995

References

Stinchcomb, Dua, et al., 1995
Stinchcomb, Audra L.; Dua, Rajesh; Paliwal, Anupam; Woodard, Ronald W.; Flynn, Gordon L., Pharmaceutical Research, 1995, 12, 10, 1526-1529, https://doi.org/10.1023/A:1016299824162 . [all data]