Pinazepam

Kovats' RI, non-polar column, custom temperature program

Data compiled by: NIST Mass Spectrometry Data Center, William E. Wallace, director

Column type Capillary
Active phase OV-1
Column length (m)
Carrier gas
Substrate
Column diameter (mm)
Phase thickness (μm)
Program not specified
I 2580.
ReferenceSchütz, 1988
Comment MSDC-RI

Kovats' RI, non-polar column, isothermal

Data compiled by: NIST Mass Spectrometry Data Center, William E. Wallace, director

Column type CapillaryCapillaryCapillaryCapillary
Active phase SE-30BP-1DB-1SPB-1
Column length (m)  25.30.25.
Carrier gas  N2N2He
Substrate
Column diameter (mm)  0.220.530.20
Phase thickness (μm)  0.251.5
Temperature (C) 250.250.250.250.
I 2529.2551.2529.2531.
ReferenceDimov and Moskovkina, 1991Japp, Garthwaite, et al., 1988Japp, Garthwaite, et al., 1988Lora-Tamayo, Rams, et al., 1986
Comment MSDC-RI MSDC-RI MSDC-RI MSDC-RI

References

Schütz, 1988
Schütz, H., Modern screening strategies in analytical toxicology with special regard to new benzodiazepines, Z. Rechtsmed., 1988, 100, 1, 19-37, https://doi.org/10.1007/BF00200362 . [all data]