4-Ethyl-5-methylthiazole

Van Den Dool and Kratz RI, non-polar column, temperature ramp

Data compiled by: NIST Mass Spectrometry Data Center, William E. Wallace, director

Column type Capillary
Active phase DB-5
Column length (m) 30.
Carrier gas
Substrate
Column diameter (mm) 0.32
Phase thickness (μm) 1.
Tstart (C) 60.
Tend (C) 250.
Heat rate (K/min) 4.
Initial hold (min) 5.
Final hold (min) 20.
I 1005.
ReferenceMadruga and Mottram, 1998
Comment MSDC-RI

Van Den Dool and Kratz RI, polar column, custom temperature program

Data compiled by: NIST Mass Spectrometry Data Center, William E. Wallace, director

Column type Capillary
Active phase CP-Wax 52CB
Column length (m) 50.
Carrier gas
Substrate
Column diameter (mm) 0.32
Phase thickness (μm) 0.21
Program 0C(5min) => fast => 60C(5min) => 4C/min => 220C(20min)
I 1412.
ReferenceMadruga and Mottram, 1998
Comment MSDC-RI

References

Madruga and Mottram, 1998
Madruga, M.S.; Mottram, D.S., The effect of pH on the formation of volatile compounds produced by heating a model system containing 5'-imp and cysteine, J. Braz. Chem. Soc., 1998, 9, 3, 261-271, https://doi.org/10.1590/S0103-50531998000300010 . [all data]