Nickel, [[2,2'-[oxybis(3,1-propanediylnitrilomethylidyne)]bis[phenolato]](2-)-N,N',O,O',O"]-

Gas phase ion energetics data

Data compiled by: Sharon G. Lias, Rhoda D. Levin, and Sherif A. Kafafi

Ionization energy determinations

IE (eV) Method Reference
7.61 ± 0.06EITaylor and Dillard, 1974

References

Taylor and Dillard, 1974
Taylor, L.T.; Dillard, J.G., Mass spectrometric study of polydentate Schiff base coordination complexes. II. Cobalt(II), nickel(II), and copper(II) complexes of N,N'-bis(salicylidene)heptanediamine, N,N'-bis(salicylidene)-3,3'-bis(aminopropyl)amine, N,N'-bis(salicylidene)-3,3'-bis(aminopropyl) ether, and N,N'-bis(salicylidene)-3,3'-bis(aminopropyl) sulfide,., Inorg. Chem., 1974, 13, 2620. [all data]