Furo[2,3-b]quinoline, 4,6,8-trimethoxy-

Normal alkane RI, non-polar column, temperature ramp

Data compiled by: NIST Mass Spectrometry Data Center, William E. Wallace, director

Column type Capillary
Active phase Optima-5
Column length (m) 30.
Carrier gas He
Substrate
Column diameter (mm) 0.2
Phase thickness (μm)
Tstart (C) 50.
Tend (C) 250.
Heat rate (K/min) 3.
Initial hold (min) 3.
Final hold (min)
I 2471.
ReferenceJacquemond-Collet, Bessière, et al., 2001
Comment MSDC-RI

References

Jacquemond-Collet, Bessière, et al., 2001
Jacquemond-Collet, I.; Bessière, J.-M.; Hannedouche, S.; Bertrand, C.; Fourasté, I.; Moulis, C., Identification of the alkaloids of Galipea officinalis by gas chromatography-mass spectrometry, Phytochem. Anal., 2001, 12, 5, 312-319, https://doi.org/10.1002/pca.594 . [all data]