2,3'-Bipyridine, 1'-acetyl-1',3,4,4',5,5',6,6'-octahydro-

Normal alkane RI, non-polar column, temperature ramp

Data compiled by: NIST Mass Spectrometry Data Center, William E. Wallace, director

Column type Capillary
Active phase DB-1
Column length (m) 30.
Carrier gas He
Substrate
Column diameter (mm) 0.32
Phase thickness (μm)
Tstart (C) 150.
Tend (C) 300.
Heat rate (K/min) 6.
Initial hold (min)
Final hold (min)
I 1935.
ReferenceGreinwald, Reyes-Chilpa, et al., 1996
Comment MSDC-RI

References

Greinwald, Reyes-Chilpa, et al., 1996
Greinwald, R.; Reyes-Chilpa, R.; Ross, J.H.; Witte, L.; Czygan, F.-C., A survey of alkaloids in the genera Harpalyce and Brongniartia (Fabaceae - Brongniartieae), Biochem. Syst. Ecol., 1996, 24, 7/8, 749-755. [all data]