Echimidine

Kovats' RI, non-polar column, temperature ramp

View large format table.

Column type Active phase I Reference Comment
CapillaryDB-12560.El-Shazly, Sarg, et al., 1996He, 170. C @ 5. min, 10. K/min, 300. C @ 15. min; Column length: 30. m

References

El-Shazly, Sarg, et al., 1996
El-Shazly, A.; Sarg, T.; Ateya, A.; Abdel Aziz, E.; El-Dahmy, S.; Witte, L.; Wink, M., Pyrrolizidine and tetrahydroisoquinoline alkaloids from Echium humile, Phytochemistry, 1996, 42, 1, 225-230, https://doi.org/10.1016/0031-9422(95)00847-0 . [all data]