Hex-2-yn-4-one, 2-methyl-

Gas phase ion energetics data

Data compiled by: Sharon G. Lias, Rhoda D. Levin, and Sherif A. Kafafi

Ionization energy determinations

IE (eV) Method Reference Comment
9.50PECarlier and Mouvier, 1979Vertical value

References

Carlier and Mouvier, 1979
Carlier, P.; Mouvier, G., Etude par spectrometrie de photoelectrons de la structure electronique des ynals et des ynones conjugues, J. Electron Spectrosc. Relat. Phenom., 1979, 17, 169. [all data]