1H-Pyrrolizine-7-methanol, 2,3,5,7a-tetrahydro-1-hydroxy-, (1S-cis)-

Van Den Dool and Kratz RI, non-polar column, temperature ramp

Data compiled by: NIST Mass Spectrometry Data Center, William E. Wallace, director

Column type CapillaryCapillary
Active phase DB-1DB-5
Column length (m) 30.30.
Carrier gas HeHe
Substrate
Column diameter (mm) 0.320.32
Phase thickness (μm)
Tstart (C) 150.150.
Tend (C) 300.300.
Heat rate (K/min) 6.6.
Initial hold (min)
Final hold (min)
I 1445.1495.
ReferenceWitte, Rubiolo, et al., 1992Witte, Rubiolo, et al., 1992
Comment MSDC-RI MSDC-RI

Kovats' RI, non-polar column, temperature ramp

View large format table.

Column type Active phase I Reference Comment
CapillaryOV-11447.El-Shazly, El-Domiaty, et al., 1998He, 6. K/min; Column length: 30. m; Tstart: 150. C; Tend: 300. C

Normal alkane RI, non-polar column, custom temperature program

View large format table.

Column type Active phase I Reference Comment
CapillaryDB-11447.Asres, Sporer, et al., 2004He; Column length: 30. m; Column diameter: 0.3 mm; Program: 120C => (6C/min or 1.5C/min) => 300C

References

Witte, Rubiolo, et al., 1992
Witte, L.; Rubiolo, P.; Bicchi, C.; Hartmann, T., Comparative analysis of pyrrolizidine alkaloids from natural sources by gas chromatography-mass spectrometry, Phytochemistry, 1992, 32, 1, 187-196, https://doi.org/10.1016/0031-9422(92)80130-7 . [all data]