1H-Pyrrolizine-1-methanol, hexahydro-7-hydroxy-, [1S-(1α,7α,7aβ)]-

Kovats' RI, non-polar column, temperature ramp

View large format table.

Column type Active phase I Reference Comment
CapillaryDB-11442.Jenett-Siems, Ott, et al., 2005He, 6. K/min; Column length: 30. m; Column diameter: 0.32 mm; Tstart: 70. C; Tend: 300. C

Van Den Dool and Kratz RI, non-polar column, temperature ramp

View large format table.

Column type Active phase I Reference Comment
CapillaryDB-11442.Witte, Rubiolo, et al., 1992He, 6. K/min; Column length: 30. m; Column diameter: 0.32 mm; Tstart: 150. C; Tend: 300. C

References

Jenett-Siems, Ott, et al., 2005
Jenett-Siems, K.; Ott, S.C.; Schimming, T.; Siems, K.; Müller, F.; Hilker, M.; Witte, L.; Hartmann, T.; Austin, D.F.; Eich, E., Ipangulines and minalobines, chemotaxonomic markers of the infrageneric Ipomoea taxon subgenus Quamoclit, section Mina, Phytochemistry, 2005, 66, 2, 223-231, https://doi.org/10.1016/j.phytochem.2004.11.019 . [all data]

Witte, Rubiolo, et al., 1992
Witte, L.; Rubiolo, P.; Bicchi, C.; Hartmann, T., Comparative analysis of pyrrolizidine alkaloids from natural sources by gas chromatography-mass spectrometry, Phytochemistry, 1992, 32, 1, 187-196, https://doi.org/10.1016/0031-9422(92)80130-7 . [all data]