Spartioidine

Kovats' RI, non-polar column, temperature ramp

View large format table.

Column type Active phase I Reference Comment
CapillaryOV-12359.El-Shazly, 200230. m/0.25 mm/0.25 μm, He, 120. C @ 3. min, 6. K/min, 300. C @ 10. min

Van Den Dool and Kratz RI, non-polar column, temperature ramp

View large format table.

Column type Active phase I Reference Comment
CapillaryDB-12343.Witte, Rubiolo, et al., 1992He, 6. K/min; Column length: 30. m; Column diameter: 0.32 mm; Tstart: 150. C; Tend: 300. C
CapillaryOV-12345.Witte, Rubiolo, et al., 199225. m/0.25 mm/0.5 μm, H2, 6. K/min; Tstart: 150. C; Tend: 300. C
CapillaryDB-52400.Witte, Rubiolo, et al., 1992He, 6. K/min; Column length: 30. m; Column diameter: 0.32 mm; Tstart: 150. C; Tend: 300. C

References

El-Shazly, 2002
El-Shazly, A., Pyrrolizidine alkaloid profiles of some Senecio species from Egypt, Z. Naturforsch. C:, 2002, 57, 429-433. [all data]

Witte, Rubiolo, et al., 1992
Witte, L.; Rubiolo, P.; Bicchi, C.; Hartmann, T., Comparative analysis of pyrrolizidine alkaloids from natural sources by gas chromatography-mass spectrometry, Phytochemistry, 1992, 32, 1, 187-196, https://doi.org/10.1016/0031-9422(92)80130-7 . [all data]