Bromoacetic acid, 2-butyl ester

Van Den Dool and Kratz RI, polar column, temperature ramp

Data compiled by: NIST Mass Spectrometry Data Center, William E. Wallace, director

Column type Capillary
Active phase OV-351
Column length (m) 25.
Carrier gas
Substrate
Column diameter (mm) 0.32
Phase thickness (μm)
Tstart (C) 50.
Tend (C)
Heat rate (K/min) 6.
Initial hold (min)
Final hold (min)
I 1454.
ReferenceKorhonen, 1984
Comment MSDC-RI

References

Korhonen, 1984
Korhonen, I.O.O., Gas-Liquid Chromatographic Analyses. XXV. Branched-Chain C3-C5 Alkyl Esters of Halogenated Acetic Acids, J. Chromatogr., 1984, 288, 51-69, https://doi.org/10.1016/S0021-9673(01)93681-7 . [all data]