Benzoic acid, 2-hydroxy-4-methoxy-6-methyl-, methyl ester

Normal alkane RI, non-polar column, temperature ramp

View large format table.

Column type Active phase I Reference Comment
CapillaryDB-5 MS1580.Stojanovic, RAdulovic, et al., 201130. m/0.25 mm/0.25 μm, Helium, 5. K/min, 290. C @ 10. min; Tstart: 70. C
CapillaryCP Sil 5 CB1546.Rycroft, Cole, et al., 199925. m/0.32 mm/0.12 μm, He, 80. C @ 2. min, 5. K/min, 275. C @ 10. min

Normal alkane RI, non-polar column, custom temperature program

View large format table.

Column type Active phase I Reference Comment
CapillaryDB-11550.Figueiredo, Sim-Sim, et al., 200530. m/0.25 mm/0.25 μm, He; Program: 45C => 3C/min => 175C => 15C/min => 300C (10min)

References

Stojanovic, RAdulovic, et al., 2011
Stojanovic, I.Z.; RAdulovic, N.S.; Mitrovic, Y.L.J.; Stamenkovic, S.M.; Stojanovic, G.S., Volatile constituents of selected Parmeliaceae lichens, J. Serb. Chem. Soc., 2011, 76, 7, 987-994, https://doi.org/10.2298/JSC101004087S . [all data]

Rycroft, Cole, et al., 1999
Rycroft, D.S.; Cole, W.J.; Aslam, N.; Lamont, Y.M.; Gabriel, R., Killarniensolide, methyl orsellinates and 9,10-dihydrophenanthrenes from the liverwort Plagiochila killarniensis from Scotland and the Azores, Phytochemistry, 1999, 50, 7, 1167-1173, https://doi.org/10.1016/S0031-9422(98)00664-5 . [all data]

Figueiredo, Sim-Sim, et al., 2005
Figueiredo, A.C.; Sim-Sim, M.; Costa, M.M.; Barroso, J.G.; Pedro, L.G.; Esquível, M.G.; Gutierres, F.; Lobo, C.; Fontinha, S., Comparison of the essential oil composition of four Plagiochila species: P. bifaria, P. maderensis, P. retrorsa and P. stricta, Flavour Fragr. J., 2005, 20, 6, 703-709, https://doi.org/10.1002/ffj.1627 . [all data]