4H-1-Benzopyran-4-one, 5-hydroxy-7-methoxy-2-phenyl-

Van Den Dool and Kratz RI, non-polar column, custom temperature program

Data compiled by: NIST Mass Spectrometry Data Center, William E. Wallace, director

Column type Capillary
Active phase HP-5MS
Column length (m) 30.
Carrier gas He
Substrate
Column diameter (mm) 0.25
Phase thickness (μm) 0.25
Program 60C (1 min) => 5 C/min => 210C => 10 C/min => 280C (15 min)
I 2628.2
ReferenceAndriamaharavo, 2014
Comment MSDC-RI

Van Den Dool and Kratz RI, non-polar column, temperature ramp

View large format table.

Column type Active phase I Reference Comment
CapillaryPE-52543.Isidorov and Vinogorova, 2003He, 3. K/min; Column length: 30. m; Column diameter: 0.25 mm; Tstart: 40. C; Tend: 280. C

References

Andriamaharavo, 2014
Andriamaharavo, N.R., Retention Data. NIST Mass Spectrometry Data Center., NIST Mass Spectrometry Data Center, 2014. [all data]