Pyrrolidine,1-(1-oxo-2-butenyl)-

Gas phase ion energetics data

Data compiled by: Sharon G. Lias, Rhoda D. Levin, and Sherif A. Kafafi

Ionization energy determinations

IE (eV) Method Reference
9.0 ± 0.1EIMathar, Bohlmann, et al., 1973

Appearance energy determinations

Ion AE (eV) Other Products MethodReferenceComment
C7H10NO+11.2 ± 0.1CH3EIMathar, Bohlmann, et al., 1973

References

Mathar, Bohlmann, et al., 1973
Mathar, W.; Bohlmann, F.; Schwarz, H., Massenspektrometrische untersuchung von Amiden. V. Uber den einfluss der N-donatorstarke auf die aktivierungs-energie der methyl-abspaltung aus crotonsaureamiden, Tetrahedron Lett., 1973, 4583. [all data]