9-Azabicyclo[4.2.1]non-7-ene

Gas phase ion energetics data

Data compiled by: Sharon G. Lias, Rhoda D. Levin, and Sherif A. Kafafi

Ionization energy determinations

IE (eV) Method Reference Comment
8.76PESchmidt, Schweig, et al., 1974Vertical value

References

Schmidt, Schweig, et al., 1974
Schmidt, H.; Schweig, A.; Anastassiou, A.G.; Yamamoto, H., Photoelectron spectroscopic evidence for bicycloconjugation in 9-azabicyclo[4,2,1]nona- 2,4,7-triene, J. Chem. Soc., Chem. Commun., 1974, 218. [all data]